Authoring Tasks - Gradle

Task has actions and Gradle has determined they should be executed as ..... Task :processTemplates BUILD SUCCESSFUL in 0s 1 actionable task: 1 executed.

https://docs.gradle.org/current/userguide/more_about_tasks.html

Finalizer task not invoked when dependent task failed Issue #3691 ...

2 dec. 2017 - gradlew -m foo Parallel execution with configuration on demand is an incubating feature. ... BUILD FAILED in 0s 1 actionable task: 1 executed ...

https://github.com/gradle/gradle/issues/3691

Continuous run failing in newer gradle versions Issue #1294 ratpack ...

16 nov. 2017 - project git:(master) ? gradle wrapper --gradle-version 4.1 BUILD SUCCESSFUL in 0s 1 actionable task: 1 executed ? project git:(master) ? .

https://github.com/ratpack/ratpack/issues/1294

[GAP-293] artifactoryPublish task seems to not be respecting altering ...

26 jun. 2018 - When I run the Gradle `tasks` task, I see the correct set of tasks (i.e. I see ... SUCCESSFUL in 4s 1 actionable task: 1 executed 9:37:52 AM: Task ...

https://www.jfrog.com/jira/browse/GAP-293?page=com.googlecode.jira-suite-utilities:transitions-summary-tabpanel

android - FAILURE: Build failed with exception - Stack Overflow

24 apr. 2018 - BUILD FAILED in 13s 9 actionable tasks: 1 executed, 8 up-to-date ... Yes, I see this error in my build after Android Studio was upgraded to 3.1 ...

https://stackoverflow.com/questions/48841742/failure-build-failed-with-exception?noredirect=1&lq=1

java - External task execution finished 'signingReport' - Stack ...

9 jul. 2017 - 1 Answer 1. active oldest votes. up vote 5 down vote. This is happening because you try to run the signing report instead of app. Select app ...

https://stackoverflow.com/questions/44996239/external-task-execution-finished-signingreport

Gradle for DevOps, Part 3

1, In Groovy, you can call execute() for any String. ... 10:21, 0 users, load average: 0.10, 0.23, 0.47 BUILD SUCCESSFUL in 1s 1 actionable task: 1 executed.

https://linchpiner.github.io/gradle-for-devops-3.html

Error Build Execution failed for task ':app:lin... | Adobe ...

Today i dot some error build for android. ... But when i want build with Signed key i got some error. I try to. ... <plugin name="onesignal-cordova-plugin" spec="^2.1.1" source="npm" /> ... 46 actionable tasks: 46 executed.

https://forums.adobe.com/thread/2517610

Using buildSrc for custom logic in Gradle builds zeroturnaround.com

28 sep. 2017 - gradlew hello > Task :hello Hello from buildSrc! BUILD SUCCESSFUL in 0s 1 actionable task: 1 executed. That's all there is to it. sayHello is a ...

https://zeroturnaround.com/rebellabs/using-buildsrc-for-custom-logic-in-gradle-builds/

Using buildSrc for custom logic in Gradle builds zeroturnaround.com

28 sep. 2017 - gradlew hello > Task :hello Hello from buildSrc! BUILD SUCCESSFUL in 0s 1 actionable task: 1 executed. That's all there is to it. sayHello is a ...

https://zeroturnaround.com/rebellabs/using-buildsrc-for-custom-logic-in-gradle-builds/

1 actionable task 1 executed

Ben je op zoek naar 1 actionable task 1 executed? Op deze pagina hebben wij een overzichtelijke collectie van websites gemaakt met meer informatie over het onderwerp 1 actionable task 1 executed. Neem eens een kijkje op een van de vele websites in ons overzicht en je vindt zeker waar je naar op zoek bent. Op Wazzzup vindt je het zeker!

#1 action movie0 actions have been selected1 action 5e1 action bus1 action coin to usd1 actionable task 1 executed2 actions in one form in html2 actions that the leader should continue to do3 action formula head and shoulders3 action guarana3 action head shoulders lisse et soyeux3 action magnesium3 action nutrition3 action sportdrank4 action framework4 action framework blue ocean strategy4 action model4 action news4 actions du sst4 actions framework blue ocean4 actions minceur juvamine avis5 action areas of the ottawa charter5 action eye serum apivita5 action news5 action verbs5 action words5 actions interdites durant le sabbat6 action bus6 action figures6 action news6 action news abc6 action news live6 action news philadelphia6 action news weather6 action shoes6 action verbs7 action news detroit7 action news live7 action news this morning8 action blvd londonderry nh 030538 action boulevard londonderry new hampshire8 action drive brampton8 action figure clothing8 action figures8 action news tampa9 action bus9 action figure9 action figures tim burton9 action games9 action movie